Target
Ribosomal protein S6 kinase beta-1
Ligand
BDBM224392
Substrate
Meas. Tech.
Enzyme Assay
pH
7.5±n/a
IC50
>1000±n/a nM
Comments
extracted
Citation
 Lan, RHuck, BRChen, XDeselm, LCQiu, HXiao, YNeagu, CMochalkin, IJohnson, TL Aminopyrimidine derivatives for use as modulators of kinase activity US Patent  US9321760 Publication Date 4/26/2016 
Target
Name:
Ribosomal protein S6 kinase beta-1
Synonyms:
70 kDa ribosomal protein S6 kinase 1 70 kDa ribosomal protein kinase (p70S6K) Protein kinase 70S6K (T412E) RPS6KB1 Ribosomal protein S6 kinase I STK14A p70S6K1
Type:
Enzyme
Mol. Mass.:
59139.89
Organism:
Homo sapiens (Human)
Description:
His-tagged S6K1.
Residue:
525
  
Inhibitor
Name:
BDBM224392
Synonyms:
US10080750, Compound 69 US9662330, Compound 70
Type:
Small organic molecule
Emp. Form.:
C21H26BrF3N6
Mol. Mass.:
499.371
SMILES:
Nc1ncnc(N2CCN(CC2)C(CN2CCCC2)c2cccc(c2)C(F)(F)F)c1Br
: