Target
Phosphatidylinositol 4,5-bisphosphate 3-kinase catalytic subunit delta isoform
Ligand
BDBM224569
Substrate
Meas. Tech.
Inhibition Assay
IC50
20±n/a nM
Citation
 King-Underwood, JIto, KMurray, PJHardy, GBrookfield, FABrown, CJ Compounds US Patent  US9321773 Publication Date 4/26/2016 
Target
Name:
Phosphatidylinositol 4,5-bisphosphate 3-kinase catalytic subunit delta isoform
Synonyms:
PI3-kinase p110 subunit delta PI3-kinase subunit p110-delta PIK3CD Phosphatidylinositol 4,5-biphosphate 3-kinase catalytic subunit delta (PIK3CD) Phosphatidylinositol 4,5-bisphosphate 3-kinase 110 kDa catalytic subunit delta (PI3K delta) Phosphatidylinositol 4,5-bisphosphate 3-kinase catalytic subunit delta (PI3Kdelta) Phosphatidylinositol 4,5-bisphosphate 3-kinase catalytic subunit delta isoform (PI3K delta) Phosphatidylinositol 4,5-bisphosphate 3-kinase catalytic subunit delta isoform (PI3K-delta) Phosphatidylinositol 4,5-bisphosphate 3-kinase catalytic subunit delta isoform (PI3Kdelta)
Type:
Enzyme Subunit
Mol. Mass.:
119489.41
Organism:
Homo sapiens (Human)
Description:
O00329
Residue:
1044
  
Inhibitor
Name:
BDBM224569
Synonyms:
US9321773, 5
Type:
Small organic molecule
Emp. Form.:
C37H33ClN8O4
Mol. Mass.:
689.162
SMILES:
Nc1ncnc2n(Cc3nc4cccc(C#CCCCC(=O)N5CCOCC5)c4c(=O)n3Cc3ccccc3Cl)nc(-c3ccc(O)cc3)c12
: