Target
Dipeptidyl peptidase 4
Ligand
BDBM224584
Substrate
BDBM224616
Meas. Tech.
DPP-IV Assay
pH
7.8±n/a
IC50
9±n/a nM
Comments
extracted
Citation
 Himmelsbach, FLangkopf, EEckhardt, MMark, MMaier, RLotz, RTadayyon, M 8-[3-amino-piperidin-1-yl]-xanthines, the preparation thereof and their use as pharmaceutical compositions US Patent  US9321791 Publication Date 4/26/2016 
Target
Name:
Dipeptidyl peptidase 4
Synonyms:
ADABP Adenosine deaminase complexing protein 2 CD_antigen=CD26 DPP4 DPPIV Dipeptidyl peptidase 4 (DPP IV) Dipeptidyl peptidase 4 (DPP4) Dipeptidyl peptidase 4 membrane form Dipeptidyl peptidase IV Dipeptidyl peptidase IV (DDP-IV) Dipeptidyl peptidase IV membrane form Dipeptidyl peptidase-IV (DPP-4) T-cell activation antigen CD26 | TP103
Type:
Enzyme
Mol. Mass.:
88271.01
Organism:
Homo sapiens (Human)
Description:
P27487
Residue:
766
  
Inhibitor
Name:
BDBM224584
Synonyms:
US10202383, Example 2(52) US9556175, 2(52)
Type:
Small organic molecule
Emp. Form.:
C25H27N7O2
Mol. Mass.:
457.5276
SMILES:
CC#CCn1c(nc2n(C)c(=O)n(Cc3ccnc4ccccc34)c(=O)c12)N1CCCC(N)C1
:
Substrate
Name:
BDBM224616
Synonyms:
US9321791, AFC, Amido-4-trifluoromethylcoumarin
Type:
Substrate
Emp. Form.:
C12H9F3N2O3
Mol. Mass.:
286.2067
SMILES:
NCC(=O)Nc1ccc2c(cc(=O)oc2c1)C(F)(F)F
: