Target
Poly [ADP-ribose] polymerase tankyrase-2
Ligand
BDBM224640
Substrate
Meas. Tech.
Chemiluminescent Assay
IC50
7±n/a nM
Citation
 Zhou, CRen, BWang, H Substituted cycloocta[5,6]pyrido[4,3,2-de]phthalazines as PARP inhibitors US Patent  US9328111 Publication Date 5/3/2016 
Target
Name:
Poly [ADP-ribose] polymerase tankyrase-2
Synonyms:
(ARTD6 or PARP5b) Poly [ADP-ribose] polymerase tankyrase-2 TNKL TNKS2_HUMAN Tankyrase 2 Tankyrase-2 Tankyrase-2 (TNKS2)
Type:
Enzyme
Mol. Mass.:
126937.16
Organism:
Homo sapiens (Human)
Description:
Q9H2K2
Residue:
1166
  
Inhibitor
Name:
BDBM224640
Synonyms:
US9328111, 13
Type:
Small organic molecule
Emp. Form.:
C18H20N4O3
Mol. Mass.:
340.3764
SMILES:
CC(C)(C)OC(=O)N1CCc2c(C1)[nH]c1cccc3c1c2n[nH]c3=O
: