Target
Cathepsin S
Ligand
BDBM225202
Substrate
BDBM225228
Meas. Tech.
Inhibition Assay
IC50
1.7±n/a nM
Citation
 Nakajima, YImada, STakasuna, YAoyama, NNigawara, TShirakami, SShirai, FSato, JNakanishi, KKubo, K Nitrogen-containing bicyclic aromatic heterocyclic compound US Patent  US9328118 Publication Date 5/3/2016 
Target
Name:
Cathepsin S
Synonyms:
CATS_HUMAN Cathepsin S (Cat S) | cathepsin S preproprotein
Type:
Protein
Mol. Mass.:
37507.38
Organism:
Homo sapiens (Human)
Description:
P25774
Residue:
331
  
Inhibitor
Name:
BDBM225202
Synonyms:
US9328118, 122
Type:
Small organic molecule
Emp. Form.:
C27H29F4N7O2
Mol. Mass.:
559.5585
SMILES:
Cn1cnc2c(nc(nc12)C#N)-c1ccc(OCCC2CCN(CC(=O)N3CC[C@H](F)C3)CC2)c(c1)C(F)(F)F
:
Substrate
Name:
BDBM225228
Synonyms:
US9328118, VVR-AMC
Type:
Substrate
Emp. Form.:
C34H45N7O7
Mol. Mass.:
663.7638
SMILES:
CC(C)C(NC(=O)OCc1ccccc1)C(=O)N[C@@H](C(C)C)C(=O)NC(CCCNC(N)=N)C(=O)Nc1ccc2c(C)cc(=O)oc2c1
: