Target
Cathepsin S
Ligand
BDBM225218
Substrate
BDBM225228
Meas. Tech.
Inhibition Assay
IC50
1.7±n/a nM
Citation
 Nakajima, YImada, STakasuna, YAoyama, NNigawara, TShirakami, SShirai, FSato, JNakanishi, KKubo, K Nitrogen-containing bicyclic aromatic heterocyclic compound US Patent  US9328118 Publication Date 5/3/2016 
Target
Name:
Cathepsin S
Synonyms:
CATS_HUMAN Cathepsin S (Cat S) | cathepsin S preproprotein
Type:
Protein
Mol. Mass.:
37507.38
Organism:
Homo sapiens (Human)
Description:
P25774
Residue:
331
  
Inhibitor
Name:
BDBM225218
Synonyms:
US9328118, 150
Type:
Small organic molecule
Emp. Form.:
C26H28F3N7O3
Mol. Mass.:
543.5408
SMILES:
CN1CCC[C@H]1C(=O)N1CC[C@@H](C1)OCCOc1ncc(cc1C(F)(F)F)-c1nc(nc2n(C)ccc12)C#N
:
Substrate
Name:
BDBM225228
Synonyms:
US9328118, VVR-AMC
Type:
Substrate
Emp. Form.:
C34H45N7O7
Mol. Mass.:
663.7638
SMILES:
CC(C)C(NC(=O)OCc1ccccc1)C(=O)N[C@@H](C(C)C)C(=O)NC(CCCNC(N)=N)C(=O)Nc1ccc2c(C)cc(=O)oc2c1
: