Target
Isoform PDE9A2 of High affinity cGMP-specific 3',5'-cyclic phosphodiesterase 9A (PDE9A2)
Ligand
BDBM224773
Substrate
Meas. Tech.
Scintillation Proximity Assay
Temperature
298.15±n/a K
IC50
23±n/a nM
Comments
extracted
Citation
 Heine, NEickmeier, CFerrera, MGiovannini, RRosenbrock, HSchaenzle, G 6-cycloalkyl-pyrazolopyrimidinones for the treatment of CNS disorders US Patent  US9328120 Publication Date 5/3/2016 
Target
Name:
Isoform PDE9A2 of High affinity cGMP-specific 3',5'-cyclic phosphodiesterase 9A (PDE9A2)
Synonyms:
High affinity cGMP-specific 3',5'-cyclic phosphodiesterase 9A (PDE9A2) PDE9A_HUMAN Phosphodiesterase 9A2
Type:
Protein
Mol. Mass.:
61702.98
Organism:
Homo sapiens (Human)
Description:
O76083-2
Residue:
533
  
Inhibitor
Name:
BDBM224773
Synonyms:
US9328120, 3
Type:
Small organic molecule
Emp. Form.:
C17H19N5O3
Mol. Mass.:
341.3645
SMILES:
O=c1[nH]c(nc2n(ncc12)C1CCOCC1)[C@@H]1CC[C@H]1c1ncco1
: