Target
Isoform PDE9A2 of High affinity cGMP-specific 3',5'-cyclic phosphodiesterase 9A (PDE9A2)
Ligand
BDBM224777
Substrate
Meas. Tech.
Scintillation Proximity Assay
Temperature
298.15±n/a K
IC50
31±n/a nM
Comments
extracted
Citation
 Heine, NEickmeier, CFerrera, MGiovannini, RRosenbrock, HSchaenzle, G 6-cycloalkyl-pyrazolopyrimidinones for the treatment of CNS disorders US Patent  US9328120 Publication Date 5/3/2016 
Target
Name:
Isoform PDE9A2 of High affinity cGMP-specific 3',5'-cyclic phosphodiesterase 9A (PDE9A2)
Synonyms:
High affinity cGMP-specific 3',5'-cyclic phosphodiesterase 9A (PDE9A2) PDE9A_HUMAN Phosphodiesterase 9A2
Type:
Protein
Mol. Mass.:
61702.98
Organism:
Homo sapiens (Human)
Description:
O76083-2
Residue:
533
  
Inhibitor
Name:
BDBM224777
Synonyms:
US9328120, 7
Type:
Small organic molecule
Emp. Form.:
C19H21F2N5O2
Mol. Mass.:
389.3991
SMILES:
Cc1coc(n1)[C@H]1CC[C@@H]1c1nc2n(ncc2c(=O)[nH]1)C1CCC(F)(F)CC1
: