Target
C-X-C chemokine receptor type 1
Ligand
BDBM291172
Substrate
Meas. Tech.
In Vitro Affinity Assay
IC50
9999±n/a nM
Citation
 Musicki, BAubert, JBoiteau, JClary, LRossio, PSchuppli-Nollet, M Disubstituted 3,4-diamino-3-cyclobutene-1,2-dione compounds for use in the treatment of chemokine-mediated diseases US Patent  US9580412 Publication Date 2/28/2017 
Target
Name:
C-X-C chemokine receptor type 1
Synonyms:
C-X-C chemokine receptor type 1 (CXCR-1) CMKAR1 CXCR1_HUMAN Interleukin-8 receptor A | Interleukin-8 receptors, CXCR1/CXCR2
Type:
Enzyme
Mol. Mass.:
39803.83
Organism:
Homo sapiens (Human)
Description:
P25024
Residue:
350
  
Inhibitor
Name:
BDBM291172
Synonyms:
2-hydroxy-N,N-dimethyl-3-(2-{[(5-methylfuran-2-yl)-(2-methyltetrahydrofuran-2-yl)methyl]amino}-3,4-dioxocyclobut-1-enylamino)benzamide | US9580412, Example 1
Type:
Small organic molecule
Emp. Form.:
C23H27N3O6
Mol. Mass.:
441.477
SMILES:
CNC(=O)c1cccc(NC2C(NC(c3ccc(C)o3)C3(C)CCCO3)C(=O)C2=O)c1O
: