Target
C-X-C chemokine receptor type 2
Ligand
BDBM291181
Substrate
Meas. Tech.
In Vitro Affinity Assay
IC50
272±n/a nM
Citation
 Musicki, BAubert, JBoiteau, JClary, LRossio, PSchuppli-Nollet, M Disubstituted 3,4-diamino-3-cyclobutene-1,2-dione compounds for use in the treatment of chemokine-mediated diseases US Patent  US9580412 Publication Date 2/28/2017 
Target
Name:
C-X-C chemokine receptor type 2
Synonyms:
C-X-C chemokine receptor type 2 (CXCR-2) CD_antigen=CD182 CXCR-2 CXCR2_HUMAN GRO/MGSA receptor IL-8 receptor type 2 IL8RB | Interleukin-8 receptor B
Type:
Protein
Mol. Mass.:
40767.88
Organism:
Homo sapiens (Human)
Description:
P25025
Residue:
360
  
Inhibitor
Name:
BDBM291181
Synonyms:
6-chloro-2-hydroxy-N,N-dimethyl-3-(2-{[(5-methylfuran-2-yl)-(tetrahydrothiophen-2-yl)methyl]amino}-3,4-dioxocyclobut-1-enylamino)benzenesulfonamide | US9580412, Example 10
Type:
Small organic molecule
Emp. Form.:
C23H27N3O5S2
Mol. Mass.:
489.608
SMILES:
CN(C)S(=O)(=O)c1cccc(Nc2c(NC(C3CCCS3)c3ccc(C)o3)c(=O)c2=O)c1C
: