Target
C-X-C chemokine receptor type 3
Ligand
BDBM291172
Substrate
Meas. Tech.
In Vitro Affinity Assay
IC50
1.30±n/a nM
Citation
 Musicki, BAubert, JBoiteau, JClary, LRossio, PSchuppli-Nollet, M Disubstituted 3,4-diamino-3-cyclobutene-1,2-dione compounds for use in the treatment of chemokine-mediated diseases US Patent  US9580412 Publication Date 2/28/2017 
Target
Name:
C-X-C chemokine receptor type 3
Synonyms:
AAO92295.1 C-X-C chemokine receptor type 3 (CXCR3) CXCR3 CXCR3_HUMAN chemokine (C-X-C motif) receptor 3
Type:
Enzyme Catalytic Domain
Mol. Mass.:
40665.65
Organism:
Homo sapiens (Human)
Description:
Residue:
368
  
Inhibitor
Name:
BDBM291172
Synonyms:
2-hydroxy-N,N-dimethyl-3-(2-{[(5-methylfuran-2-yl)-(2-methyltetrahydrofuran-2-yl)methyl]amino}-3,4-dioxocyclobut-1-enylamino)benzamide | US9580412, Example 1
Type:
Small organic molecule
Emp. Form.:
C23H27N3O6
Mol. Mass.:
441.477
SMILES:
CNC(=O)c1cccc(NC2C(NC(c3ccc(C)o3)C3(C)CCCO3)C(=O)C2=O)c1O
: