Target
C-C chemokine receptor type 6
Ligand
BDBM291177
Substrate
Meas. Tech.
In Vitro Affinity Assay
IC50
9.70±n/a nM
Citation
 Musicki, BAubert, JBoiteau, JClary, LRossio, PSchuppli-Nollet, M Disubstituted 3,4-diamino-3-cyclobutene-1,2-dione compounds for use in the treatment of chemokine-mediated diseases US Patent  US9580412 Publication Date 2/28/2017 
Target
Name:
C-C chemokine receptor type 6
Synonyms:
C-C chemokine receptor type 6 CCR6 CKRL3 GPR29 | STRL22
Type:
Enzyme
Mol. Mass.:
42510.84
Organism:
Homo sapiens (Human)
Description:
P51684
Residue:
374
  
Inhibitor
Name:
BDBM291177
Synonyms:
US9580412, Example 6 methyl (R)-1-[2-hydroxy-3-(2-{[(5-methylfuran-2-yl)-(tetrahydrothiophen-2-yl)methyl]amino}-3,4-dioxocyclobut-1-enylamino)benzoyl]pyrrolidine-2-carboxylate
Type:
Small organic molecule
Emp. Form.:
C27H29N3O7S
Mol. Mass.:
539.6
SMILES:
COC(=O)[C@H]1CCCN1C(=O)c1cccc(Nc2c(NC(C3CCCS3)c3ccc(C)o3)c(=O)c2=O)c1O
: