Target
C-X-C chemokine receptor type 3
Ligand
BDBM291181
Substrate
Meas. Tech.
In Vitro Affinity Assay
IC50
93.0±n/a nM
Citation
 Musicki, BAubert, JBoiteau, JClary, LRossio, PSchuppli-Nollet, M Disubstituted 3,4-diamino-3-cyclobutene-1,2-dione compounds for use in the treatment of chemokine-mediated diseases US Patent  US9580412 Publication Date 2/28/2017 
Target
Name:
C-X-C chemokine receptor type 3
Synonyms:
AAO92295.1 C-X-C chemokine receptor type 3 (CXCR3) CXCR3 CXCR3_HUMAN chemokine (C-X-C motif) receptor 3
Type:
Enzyme Catalytic Domain
Mol. Mass.:
40665.65
Organism:
Homo sapiens (Human)
Description:
Residue:
368
  
Inhibitor
Name:
BDBM291181
Synonyms:
6-chloro-2-hydroxy-N,N-dimethyl-3-(2-{[(5-methylfuran-2-yl)-(tetrahydrothiophen-2-yl)methyl]amino}-3,4-dioxocyclobut-1-enylamino)benzenesulfonamide | US9580412, Example 10
Type:
Small organic molecule
Emp. Form.:
C23H27N3O5S2
Mol. Mass.:
489.608
SMILES:
CN(C)S(=O)(=O)c1cccc(Nc2c(NC(C3CCCS3)c3ccc(C)o3)c(=O)c2=O)c1C
: