Target
Histone-lysine N-methyltransferase EHMT2
Ligand
BDBM225241
Substrate
Meas. Tech.
Enzymatic Assay
pH
8.5±n/a
Temperature
298.15±n/a K
IC50
>4.0e+4±n/a nM
Comments
extracted
Citation
 Zhang, JYao, DJiang, YHuang, JYang, SWang, J Synthesis and biological evaluation of benzimidazole derivatives as the G9a Histone Methyltransferase inhibitors that induce autophagy and apoptosis of breast cancer cells. Bioorg Chem 72:168-181 (2017)  
Target
Name:
Histone-lysine N-methyltransferase EHMT2
Synonyms:
BAT8 EHMT2 G9A Histone-lysine N-methyltransferase EHMT1/EHMT2 KMT1C Protein G9a (G9a)
Type:
Enzyme
Mol. Mass.:
132339.87
Organism:
Homo sapiens (Human)
Description:
Q96KQ7
Residue:
1210
  
Inhibitor
Name:
BDBM225241
Synonyms:
3-Nitro-N-(2-phenylbenzo[d]oxazol-6-yl)benzenesulfonamide (2) | MT-pep
Type:
Small organic molecule
Emp. Form.:
C63H91N12O24P
Mol. Mass.:
1431.4364
SMILES:
CC[C@H](C)[C@H](NC(=O)[C@@H]1CCCN1C(=O)[C@@H](NC(=O)[C@H](CCC(O)=O)NC(=O)[C@H](CCC(O)=O)NC(=O)[C@H](Cc1ccc(OP(O)(O)=O)cc1)NC(=O)[C@H](CCC(N)=O)NC(=O)[C@@H]1CCCN1C(=O)[C@H](CCC(O)=O)NC(=O)[C@H](C)N)[C@@H](C)CC)C(=O)N[C@@H](Cc1ccc(O)cc1)C(O)=O
: