Target
Serine/threonine-protein kinase pim-3
Ligand
BDBM291173
Substrate
Meas. Tech.
Enzyme Assay
pH
7.5±n/a
Temperature
298.15±n/a K
IC50
<10±n/a nM
Comments
extracted
Citation
 Sun, YFeng, HLi, YMei, SPan, JWang, AYe, HZhang, K Bicyclic aromatic carboxamide compounds useful as Pim kinase inhibitors US Patent  US9580418 Publication Date 2/28/2017 
Target
Name:
Serine/threonine-protein kinase pim-3
Synonyms:
PIM3 Serine/threonine-protein kinase pim-3 (PIM3)
Type:
Protein
Mol. Mass.:
35888.19
Organism:
Homo sapiens (Human)
Description:
Q86V86
Residue:
326
  
Inhibitor
Name:
BDBM291173
Synonyms:
N-{4-[(3S,5R)-3-Amino-5-methylpiperidin-1-yl]pyridin-3-yl}-7-(2,6-difluorophenyl)-1,5-naphthyridine-2-carboxamide US9890162, Example 1
Type:
Small organic molecule
Emp. Form.:
C26H24F2N6O
Mol. Mass.:
474.5052
SMILES:
C[C@@H]1C[C@H](N)CN(C1)c1ccncc1NC(=O)c1ccc2ncc(cc2n1)-c1c(F)cccc1F
: