Target
Serine/threonine-protein kinase pim-1
Ligand
BDBM291199
Substrate
Meas. Tech.
Enzyme Assay
pH
7.5±n/a
Temperature
298.15±n/a K
IC50
<10±n/a nM
Comments
extracted
Citation
 Sun, YFeng, HLi, YMei, SPan, JWang, AYe, HZhang, K Bicyclic aromatic carboxamide compounds useful as Pim kinase inhibitors US Patent  US9580418 Publication Date 2/28/2017 
Target
Name:
Serine/threonine-protein kinase pim-1
Synonyms:
PIM-1 Kinase PIM1_HUMAN Serine/threonine-protein kinase (PIM1) Serine/threonine-protein kinase PIM1 | Serine/threonine-protein kinase pim-1 (PIM1)
Type:
Protein
Mol. Mass.:
35681.82
Organism:
Homo sapiens (Human)
Description:
P11309
Residue:
313
  
Inhibitor
Name:
BDBM291199
Synonyms:
N-{4-[(3S,5R)-3-Amino-5-methylpiperidin-1-yl]pyridin-3-yl}-7-(4-methylpiperazin-1-yl)quinoline-2-carboxamide US9890162, Example 19
Type:
Small organic molecule
Emp. Form.:
C26H33N7O
Mol. Mass.:
459.5865
SMILES:
C[C@@H]1C[C@H](N)CN(C1)c1ccncc1NC(=O)c1ccc2ccc(cc2n1)N1CCN(C)CC1
: