Target
Serine/threonine-protein kinase pim-3
Ligand
BDBM291220
Substrate
Meas. Tech.
Enzyme Assay
pH
7.5±n/a
Temperature
298.15±n/a K
IC50
<10±n/a nM
Comments
extracted
Citation
 Sun, YFeng, HLi, YMei, SPan, JWang, AYe, HZhang, K Bicyclic aromatic carboxamide compounds useful as Pim kinase inhibitors US Patent  US9580418 Publication Date 2/28/2017 
Target
Name:
Serine/threonine-protein kinase pim-3
Synonyms:
PIM3 Serine/threonine-protein kinase pim-3 (PIM3)
Type:
Protein
Mol. Mass.:
35888.19
Organism:
Homo sapiens (Human)
Description:
Q86V86
Residue:
326
  
Inhibitor
Name:
BDBM291220
Synonyms:
N-{4-[(3R,4R,5S)-3-Amino-5-cyclopropyl-4-hydroxypiperidin-1-yl]pyridin-3-yl}-7-(3-oxa-9-azaspiro[5.5]undec-9-yl)-1,5-naphthyridine-2-carboxamide US9890162, Example 40
Type:
Small organic molecule
Emp. Form.:
C31H39N7O3
Mol. Mass.:
557.6865
SMILES:
N[C@@H]1CN(C[C@H](C2CC2)[C@H]1O)c1ccncc1NC(=O)c1ccc2ncc(cc2n1)N1CCC2(CCOCC2)CC1
: