Target
Serine/threonine-protein kinase pim-2
Ligand
BDBM291224
Substrate
Meas. Tech.
Enzyme Assay
pH
7.5±n/a
Temperature
298.15±n/a K
IC50
<100±n/a nM
Comments
extracted
Citation
 Sun, YFeng, HLi, YMei, SPan, JWang, AYe, HZhang, K Bicyclic aromatic carboxamide compounds useful as Pim kinase inhibitors US Patent  US9580418 Publication Date 2/28/2017 
Target
Name:
Serine/threonine-protein kinase pim-2
Synonyms:
PIM2 Pim-2h Serine/threonine-protein kinase PIM | Serine/threonine-protein kinase pim-2 (PIM2)
Type:
Serine/threonine-protein kinase
Mol. Mass.:
34185.93
Organism:
Homo sapiens (Human)
Description:
Q9P1W9
Residue:
311
  
Inhibitor
Name:
BDBM291224
Synonyms:
N-{4-[(3R,4R,5S)-3-Amino-4-hydroxy-5-methylpiperidin-1-yl]pyridin-3-yl}-7-(1-ethyl-1H-pyrazol-4-yl)quinoline-2-carboxamide US9890162, Example 44
Type:
Small organic molecule
Emp. Form.:
C26H29N7O2
Mol. Mass.:
471.5542
SMILES:
CCn1cc(cn1)-c1ccc2ccc(nc2c1)C(=O)Nc1cnccc1N1C[C@H](C)[C@@H](O)[C@H](N)C1
: