Target
Alpha-glucosidase MAL32
Ligand
BDBM225281
Substrate
Meas. Tech.
In Vitro α-Glucosidase Inhibitory Assay
pH
6.8±0
Temperature
310.15±0 K
IC50
1.4595e+5± 4.6e+2 nM
Citation
 Wang, GWang, JXie, ZChen, MLi, LPeng, YChen, SLi, WDeng, B Discovery of 3,3-di(indolyl)indolin-2-one as a novel scaffold for a-glucosidase inhibitors: In silico studies and SAR predictions Bioorg Chem 72:228-233 (2017)   
Target
Name:
Alpha-glucosidase MAL32
Synonyms:
Alpha-glucosidase MAL32 MAL32_YEAST Maltase alpha-Glucosidase (alpha-Glu) | alpha-Glucosidase (α-Glucosidase)
Type:
Hydrolase
Mol. Mass.:
68132.36
Organism:
Saccharomyces cerevisiae
Description:
Purchased from Wako Fine Chemicals Co. Ltd.
Residue:
584
  
Inhibitor
Name:
BDBM225281
Synonyms:
1H,1''H-[3,3':3',3''-terindol]-2'(1'H)-one (4a)
Type:
Small organic molecule
Emp. Form.:
C24H17N3O
Mol. Mass.:
363.4113
SMILES:
O=C1Nc2ccccc2C1(c1c[nH]c2ccccc12)c1c[nH]c2ccccc12
: