Target
DNA-dependent protein kinase catalytic subunit
Ligand
BDBM225297
Substrate
BDBM225294
Meas. Tech.
DNA-PK Enzyme Inhibitory Assay
IC50
2.5e+2±n/a nM
Citation
 Ihmaid, SAhmed, HEAAli, AASherif, YETarazi, HMRiyadh, SMZayed, MFAbulkhair, HSRateb, HS Rational design, synthesis, pharmacophore modeling, and docking studies for identification of novel potent DNA-PK inhibitors Bioorg Chem 72:234-247 (2017)   
Target
Name:
DNA-dependent protein kinase catalytic subunit
Synonyms:
DNA-PK catalytic subunit DNA-dependent protein kinase (DNA-PK) DNA-dependent protein kinase catalytic subunit (DNA-PK) HYRC PRKDC | PRKDC_HUMAN
Type:
Protein
Mol. Mass.:
469114.78
Organism:
Homo sapiens (Human)
Description:
P78527
Residue:
4128
  
Inhibitor
Name:
BDBM225297
Synonyms:
2-((8-Methyl-2-morpholino-4-oxo-4H-benzo[e][1,3]oxazin-7-yl)oxy)-N-(4-(N-(pyridin-2-yl)sulfamoyl)phenyl)acetamide (7c)
Type:
Small organic molecule
Emp. Form.:
C26H25N5O7S
Mol. Mass.:
551.571
SMILES:
Cc1c(OCC(=O)Nc2ccc(cc2)S(=O)(=O)Nc2ccccn2)ccc2c1oc(nc2=O)N1CCOCC1
:
Substrate
Name:
BDBM225294
Synonyms:
EPPLSQEAFADLWKK
Type:
Small organic molecule
Emp. Form.:
C82H123N19O24
Mol. Mass.:
1758.9669
SMILES:
CC(C)C[C@H](NC(=O)[C@H](CC(O)=O)NC(=O)[C@H](C)NC(=O)[C@H](Cc1ccccc1)NC(=O)[C@H](C)NC(=O)[C@H](CCC(O)=O)NC(=O)[C@H](CCC(N)=O)NC(=O)[C@H](CO)NC(=O)[C@H](CC(C)C)NC(=O)[C@@H]1CCCN1C(=O)[C@@H]1CCCN1C(=O)[C@@H](N)CCC(O)=O)C(=O)N[C@@H](Cc1c[nH]c2ccccc12)C(=O)N[C@@H](CCCCN)C(=O)N[C@@H](CCCCN)C(O)=O
: