Target
Cyclin-dependent kinase 2
Ligand
BDBM8068
Substrate
Meas. Tech.
OctetRed_Method2
Kd
44.8±12.3 nM
Citation
 D3R, DD CSAR CDK2-CyclinA D3R 219:0 (2015) Target
Name:
Cyclin-dependent kinase 2
Synonyms:
CDK2 CDK2_HUMAN Cell division protein kinase 2 Protein cereblon/Cyclin-dependent kinase 2 | p33 protein kinase
Type:
Enzyme Subunit
Mol. Mass.:
33938.17
Organism:
Homo sapiens (Human)
Description:
P24941
Residue:
298
  
Inhibitor
Name:
BDBM8068
Synonyms:
2-Anilino-4-(thiazol-5-yl)pyrimidine deriv. 39 2-chloro-4-N-[4-(2,4-dimethyl-1,3-thiazol-5-yl)pyrimidin-2-yl]-1-N,1-N-dimethylbenzene-1,4-diamine | CS20
Type:
Small organic molecule
Emp. Form.:
C17H18ClN5S
Mol. Mass.:
359.876
SMILES:
CN(C)c1ccc(Nc2nccc(n2)-c2sc(C)nc2C)cc1Cl
: