Target
Cyclin-dependent kinase 2
Ligand
BDBM91790
Substrate
Meas. Tech.
OctetRed_Method1
Kd
>100000±n/a nM
Citation
 D3R, DD CSAR CDK2-CyclinA D3R 219:0 (2015) Target
Name:
Cyclin-dependent kinase 2
Synonyms:
CDK2 CDK2_HUMAN Cell division protein kinase 2 Protein cereblon/Cyclin-dependent kinase 2 | p33 protein kinase
Type:
Enzyme Subunit
Mol. Mass.:
33938.17
Organism:
Homo sapiens (Human)
Description:
P24941
Residue:
298
  
Inhibitor
Name:
BDBM91790
Synonyms:
CS37
Type:
Emp. Form.:
C21H20N4O2S2
Mol. Mass.:
424.539
SMILES:
COc1ccc(NC(=O)CCSc2nnc3scc(-c4ccc(C)cc4)n23)cc1
: