Target
Cyclin-dependent kinase 2
Ligand
BDBM91732
Substrate
Meas. Tech.
OctetRed_Method1
Kd
>100000±n/a nM
Citation
 D3R, DD CSAR CDK2 Kinase D3R 220:0 (2015) Target
Name:
Cyclin-dependent kinase 2
Synonyms:
CDK2 CDK2_HUMAN Cell division protein kinase 2 Protein cereblon/Cyclin-dependent kinase 2 | p33 protein kinase
Type:
Enzyme Subunit
Mol. Mass.:
33938.17
Organism:
Homo sapiens (Human)
Description:
P24941
Residue:
298
  
Inhibitor
Name:
BDBM91732
Synonyms:
CS102
Type:
Emp. Form.:
C21H20N4O5
Mol. Mass.:
408.4073
SMILES:
[O-][N+](=O)c1cccc(c1)-c1nn(CC(=O)NCC2CCCO2)c(=O)c2ccccc12
: