Target
Serine/threonine-protein kinase Chk1 [2-280]
Ligand
BDBM91905
Substrate
Meas. Tech.
33P-Radiometric_Method1
Ki
3260±n/a nM
Citation
 D3R, DD Abbott CHK1 Kinase D3R 221:0 (2015) Target
Name:
Serine/threonine-protein kinase Chk1 [2-280]
Synonyms:
CHEK1 CHK1_HUMAN | CHK1_Kinase
Type:
Mol. Mass.:
32109.16
Organism:
Homo sapiens (Human)
Description:
O14757[2-280]
Residue:
279
  
Inhibitor
Name:
BDBM91905
Synonyms:
Chk1_39
Type:
Emp. Form.:
C19H21BrN6O
Mol. Mass.:
429.314
SMILES:
CCC1CCCCN1c1ccc(Br)cc1NC(=O)Nc1cnc(cn1)C#N
: