Target
Serine/threonine-protein kinase Chk1 [2-280]
Ligand
BDBM225347
Substrate
Meas. Tech.
33P-Radiometric_Method1
Ki
>10000±n/a nM
Citation
 D3R, DD Abbott CHK1 Kinase D3R 221:0 (2015) Target
Name:
Serine/threonine-protein kinase Chk1 [2-280]
Synonyms:
CHEK1 CHK1_HUMAN | CHK1_Kinase
Type:
Mol. Mass.:
32109.16
Organism:
Homo sapiens (Human)
Description:
O14757[2-280]
Residue:
279
  
Inhibitor
Name:
BDBM225347
Synonyms:
Chk1_54
Type:
Small Organic Molecule
Emp. Form.:
C26H29N3O2
Mol. Mass.:
415.5274
SMILES:
CC1CCC(CC1)NCc1ccc-2c(Cc3c-2n[nH]c3-c2cccc(CC(O)=O)c2)c1
: