Target
UDP-3-O-acyl-N-acetylglucosamine deacetylase
Ligand
BDBM92271
Substrate
Meas. Tech.
Thermofluor_Method1
Kd
>100000±n/a nM
Citation
 D3R, DD CSAR LpxC D3R 224:0 (2015) Target
Name:
UDP-3-O-acyl-N-acetylglucosamine deacetylase
Synonyms:
LPXC_PSEAE UDP-3-O-[3-hydroxymyristoyl] N-acetylglucosamine deacetylase UDP-3-O-[3-hydroxymyristoyl] N-acetylglucosamine deacetylase (LpxC) UDP-3-O-acyl-GlcNAc deacetylase (LpxC) lpxC
Type:
Enzyme
Mol. Mass.:
33428.15
Organism:
Pseudomonas aeruginosa
Description:
P47205
Residue:
303
  
Inhibitor
Name:
BDBM92271
Synonyms:
CS264
Type:
Emp. Form.:
C21H23N5O4
Mol. Mass.:
409.4384
SMILES:
CC1(CNC(=O)[C@H](CN)NC(=O)c2ccc(cc2)-c2ccccc2)NC(=O)NC1=O
: