Target
Tyrosine-protein kinase SYK [355-635]
Ligand
BDBM225519
Substrate
Meas. Tech.
SYK assay_HTRF
IC50
0.75±n/a nM
Citation
 D3R, DD GSK SYK Kinase D3R 225:0 (2015) Target
Name:
Tyrosine-protein kinase SYK [355-635]
Synonyms:
KSYK_HUMAN SYK Kinase
Type:
Mol. Mass.:
32610.83
Organism:
Homo sapiens (Human)
Description:
P43405[355-635]
Residue:
281
  
Inhibitor
Name:
BDBM225519
Synonyms:
GTC000227A
Type:
Small Organic Molecule
Emp. Form.:
C21H22N8O2S
Mol. Mass.:
450.517
SMILES:
NCCCN(c1ccnc(Nc2ccc3CNS(=O)(=O)c3c2)n1)c1cccc2[nH]ncc12
: