Target
tRNA (guanine-N(1)-)-methyltransferase
Ligand
BDBM225683
Substrate
Meas. Tech.
ScintillationProximity_Assay
IC50
7943±n/a nM
Citation
 D3R, DD GSK TrmD D3R 226:0 (2015) Target
Name:
tRNA (guanine-N(1)-)-methyltransferase
Synonyms:
TRMD_HAEIN | trmD
Type:
Mol. Mass.:
27538.79
Organism:
Haemophilus influenzae (strain ATCC 51907 / DSM 11121 / KW20 / Rd)
Description:
Residue:
246
  
Inhibitor
Name:
BDBM225683
Synonyms:
GTC000456A
Type:
Small Organic Molecule
Emp. Form.:
C8H12N4O3
Mol. Mass.:
212.2059
SMILES:
Nc1nonc1C(=O)N[C@@H]1CC[C@H](O)C1
: