Target
tRNA (guanine-N(1)-)-methyltransferase
Ligand
BDBM225698
Substrate
Meas. Tech.
ScintillationProximity_Assay
IC50
794±n/a nM
Citation
 D3R, DD GSK TrmD D3R 226:0 (2015) Target
Name:
tRNA (guanine-N(1)-)-methyltransferase
Synonyms:
TRMD_HAEIN | trmD
Type:
Mol. Mass.:
27538.79
Organism:
Haemophilus influenzae (strain ATCC 51907 / DSM 11121 / KW20 / Rd)
Description:
Residue:
246
  
Inhibitor
Name:
BDBM225698
Synonyms:
GTC000471A
Type:
Small Organic Molecule
Emp. Form.:
C18H23N5O
Mol. Mass.:
325.4081
SMILES:
CN1CCN(CC1)c1ccccc1CNc1ccc(cn1)C(N)=O
: