Target
Fibroblast growth factor receptor 4
Ligand
BDBM291234
Substrate
Meas. Tech.
Enzymatic Assay
pH
7.5±n/a
IC50
<10±n/a nM
Comments
extracted
Citation
 Lu, LWu, LShen, BYao, W Bicyclic heterocycles as FGFR4 inhibitors US Patent  US9580423 Publication Date 2/28/2017 
Target
Name:
Fibroblast growth factor receptor 4
Synonyms:
CD_antigen: CD334 FGFR4 FGFR4 Fibroblast growth factor receptor JK2 TKF
Type:
Protein
Mol. Mass.:
87957.45
Organism:
Homo sapiens (Human)
Description:
P22455
Residue:
802
  
Inhibitor
Name:
BDBM291234
Synonyms:
N-(3-(2'-(2,6-difluoro-3,5-dimethoxyphenyl)-3'-oxo-2',3'-dihydro-1'H-spiro[cyclopropane-1,4'-[2,7]naphthyridine]-6'-yl)-4-methylphenyl)acrylamide US9580423, Example 2 | US9801889, Example 2
Type:
Small organic molecule
Emp. Form.:
C28H25F2N3O4
Mol. Mass.:
505.5126
SMILES:
COc1cc(OC)c(F)c(N2Cc3cnc(cc3C3(CC3)C2=O)-c2cc(NC(=O)C=C)ccc2C)c1F
: