Target
Urokinase-type plasminogen activator [179-424,C299A,N323Q]
Ligand
BDBM92308
Substrate
Meas. Tech.
Photometric_Method1
Ki
66.3±n/a nM
Citation
 D3R, DD Abbott Urokinase D3R 227:0 (2015) Target
Name:
Urokinase-type plasminogen activator [179-424,C299A,N323Q]
Synonyms:
PLAU Urokinase
Type:
Mol. Mass.:
27687.84
Organism:
Homo sapiens (Human)
Description:
P00749[179-424,C299A,N323Q]
Residue:
246
  
Inhibitor
Name:
BDBM92308
Synonyms:
uPa_31
Type:
Emp. Form.:
C27H28N4O
Mol. Mass.:
424.5374
SMILES:
NC(=N)c1ccc2cc(ccc2c1)C(=O)Nc1ccc2CCN=C(C3CCCCC3)c2c1
: