Target
Uncharacterized PhzA/B-like protein PA3332
Ligand
BDBM17292
Substrate
Meas. Tech.
Thermofluor_Method2
Kd
19000±3350 nM
Citation
 D3R, DD Baker-CSAR DIG-BP D3R 248:0 (2015) Target
Name:
Uncharacterized PhzA/B-like protein PA3332
Synonyms:
DIG-BP Y3332_PSEAE
Type:
Mol. Mass.:
15916.84
Organism:
Pseudomonas aeruginosa (strain ATCC 15692 / DSM 22644 / CIP 104116 / JCM 14847 / LMG 12228 / 1C / PRS 101 / PAO1)
Description:
Residue:
141
  
Inhibitor
Name:
BDBM17292
Synonyms:
(1S,10R,11S,14S,15S)-15-methyltetracyclo[8.7.0.0^{2,7}.0^{11,15}]heptadeca-2,4,6-triene-5,14-diol 17α-ethinylestradiol CHEMBL135 ESTRADIOL Ovocyclin US9040509, E2 US9561238, E2 [2,4,6,7-3H]-E2 [3H]]estradiol
Type:
Steroid
Emp. Form.:
C18H24O2
Mol. Mass.:
272.382
SMILES:
[H][C@@]12CC[C@H](O)[C@@]1(C)CC[C@]1([H])c3ccc(O)cc3CC[C@@]21[H]
: