Target
Bile acid receptor
Ligand
BDBM225934
Substrate
Meas. Tech.
Scintillation Proximity Assay (SPA)
pH
7.4±n/a
IC50
570±n/a nM
Comments
extracted
Citation
 D3R, DD Drug Design Data Resource Grand Challenge 2 Dataset: FXR - Farnesoid X Receptor D3R 882:0 (2017) Target
Name:
Bile acid receptor
Synonyms:
BAR FXR HRR1 NR1H4_HUMAN RIP14 Retinoid X receptor-interacting protein 14 | farnesoid x receptor
Type:
Nuclear Receptor
Mol. Mass.:
55916.24
Organism:
Homo sapiens (Human)
Description:
Q96RI1
Residue:
486
  
Inhibitor
Name:
BDBM225934
Synonyms:
FXR_23
Type:
Small Organic Molecule
Emp. Form.:
C25H23ClN2O2
Mol. Mass.:
418.915
SMILES:
CC(C)c1onc(c1C(=O)N[C@H](C)c1ccc2ccccc2c1)-c1ccccc1Cl
: