Target
Bile acid receptor
Ligand
BDBM225953
Substrate
Meas. Tech.
Scintillation Proximity Assay (SPA)
pH
7.4±n/a
IC50
>100000±n/a nM
Comments
extracted
Citation
 D3R, DD Drug Design Data Resource Grand Challenge 2 Dataset: FXR - Farnesoid X Receptor D3R 882:0 (2017) Target
Name:
Bile acid receptor
Synonyms:
BAR FXR HRR1 NR1H4_HUMAN RIP14 Retinoid X receptor-interacting protein 14 | farnesoid x receptor
Type:
Nuclear Receptor
Mol. Mass.:
55916.24
Organism:
Homo sapiens (Human)
Description:
Q96RI1
Residue:
486
  
Inhibitor
Name:
BDBM225953
Synonyms:
FXR_43
Type:
Small Organic Molecule
Emp. Form.:
C27H25FN4O3S
Mol. Mass.:
504.576
SMILES:
Fc1ccccc1S(=O)(=O)N1CCc2cc(C(=O)NCc3ccccc3)n(Cc3ccncc3)c2C1
: