Target
Coagulation factor X
Ligand
BDBM226028
Substrate
Meas. Tech.
D3R246
IC50
3.89±n/a nM
Citation
 D3R, DD GSK FactorXA-2 D3R 246:0 (2015) Target
Name:
Coagulation factor X
Synonyms:
Activated coagulation factor X (FXa) Coagulation factor X precursor F10 Factor X heavy chain Factor Xa Stuart-Prower factor
Type:
Enzyme
Mol. Mass.:
54726.60
Organism:
Homo sapiens (Human)
Description:
Residue:
488
  
Inhibitor
Name:
BDBM226028
Synonyms:
GTC000016A
Type:
Small Organic Molecule
Emp. Form.:
C21H24ClN3O7S3
Mol. Mass.:
562.079
SMILES:
C[C@H](N1CC[C@H](N(CC(O)=O)S(=O)(=O)c2ccc(s2)-c2ccc(Cl)s2)C1=O)C(=O)N1CCOCC1
: