Target
Acetylcholinesterase
Ligand
BDBM226120
Substrate
Meas. Tech.
AChE/BChE Inhibitory Assay
pH
8±n/a
Temperature
303.15±n/a K
IC50
33800±1320 nM
Comments
extracted
Citation
 Sultana, NSarfraz, MTanoli, STAkram, MSSadiq, ARashid, UTariq, MI Synthesis, crystal structure determination, biological screening and docking studies of N1-substituted derivatives of 2,3-dihydroquinazolin-4(1H)-one as inhibitors of cholinesterases. Bioorg Chem 72:256-267 (2017)   
Target
Name:
Acetylcholinesterase
Synonyms:
ACES_ELEEL Acetylcholinesterase (EeAChE) | ache
Type:
Enzyme
Mol. Mass.:
71812.79
Organism:
Electrophorus electricus (Electric eel)
Description:
Residue:
633
  
Inhibitor
Name:
BDBM226120
Synonyms:
1-Ethyl-2,2-dimethyl-2,3-dihydro-1H-quinazolin-4-one (2a)
Type:
Small organic molecule
Emp. Form.:
C12H16N2O
Mol. Mass.:
204.2682
SMILES:
CCN1c2ccccc2C(=O)NC1(C)C
: