Target
Carboxylic ester hydrolase
Ligand
BDBM226125
Substrate
Meas. Tech.
AChE/BChE Inhibitory Assay
pH
8±n/a
Temperature
303.15±n/a K
IC50
21700±1900 nM
Comments
extracted
Citation
 Sultana, NSarfraz, MTanoli, STAkram, MSSadiq, ARashid, UTariq, MI Synthesis, crystal structure determination, biological screening and docking studies of N1-substituted derivatives of 2,3-dihydroquinazolin-4(1H)-one as inhibitors of cholinesterases. Bioorg Chem 72:256-267 (2017)   
Target
Name:
Carboxylic ester hydrolase
Synonyms:
BuChE Butyrylcholine esterase Butyrylcholinesterase (BChE) Butyrylcholinesterase (EqBuChE) butyrylcholinesterase precursor
Type:
Protein
Mol. Mass.:
68842.83
Organism:
Equus caballus (Horse)
Description:
Q9N1N9
Residue:
602
  
Inhibitor
Name:
BDBM226125
Synonyms:
1-Benzyl-2-methyl-2-phenyl-2,3-dihydro-1H-quinazolin-4-one (2f)
Type:
Small organic molecule
Emp. Form.:
C22H20N2O
Mol. Mass.:
328.407
SMILES:
CC1(NC(=O)c2ccccc2N1Cc1ccccc1)c1ccccc1
: