Target
Carboxylic ester hydrolase
Ligand
BDBM226139
Substrate
Meas. Tech.
AChE/BChE Inhibitory Assay
pH
8±n/a
Temperature
303.15±n/a K
IC50
4600±130 nM
Comments
extracted
Citation
 Sultana, NSarfraz, MTanoli, STAkram, MSSadiq, ARashid, UTariq, MI Synthesis, crystal structure determination, biological screening and docking studies of N1-substituted derivatives of 2,3-dihydroquinazolin-4(1H)-one as inhibitors of cholinesterases. Bioorg Chem 72:256-267 (2017)   
Target
Name:
Carboxylic ester hydrolase
Synonyms:
BuChE Butyrylcholine esterase Butyrylcholinesterase (BChE) Butyrylcholinesterase (EqBuChE) butyrylcholinesterase precursor
Type:
Protein
Mol. Mass.:
68842.83
Organism:
Equus caballus (Horse)
Description:
Q9N1N9
Residue:
602
  
Inhibitor
Name:
BDBM226139
Synonyms:
1-(4-Chloro-benzyl)-2-methyl-2-propyl-2,3-dihydro-1H-quinazolin-4-one (2t)
Type:
Small organic molecule
Emp. Form.:
C19H21ClN2O
Mol. Mass.:
328.836
SMILES:
CCCC1(C)NC(=O)c2ccccc2N1Cc1ccc(Cl)cc1
: