Target
Tyrosine-protein kinase BTK
Ligand
BDBM291291
Substrate
Meas. Tech.
BTK Inhibitory Activity
pH
7.5±n/a
IC50
14.2±n/a nM
Comments
extracted
Citation
 Iguchi, SHosoi, FSagara, T Fused pyrimidine compound or salt thereof US Patent  US9580432 Publication Date 2/28/2017 
Target
Name:
Tyrosine-protein kinase BTK
Synonyms:
AGMX1 Agammaglobulinaemia tyrosine kinase B cell progenitor kinase BPK BTK_HUMAN Tyrosine Kinase BTK Tyrosine-protein kinase BTK (BTK)
Type:
Enzyme
Mol. Mass.:
76289.95
Organism:
Homo sapiens (Human)
Description:
Q06187
Residue:
659
  
Inhibitor
Name:
BDBM291291
Synonyms:
US9580432, Example 22
Type:
Small organic molecule
Emp. Form.:
C22H20N8O3
Mol. Mass.:
444.446
SMILES:
CC#CC(=O)N1CCC[C@H](C1)n1nc(C(=O)Nc2nc3ccccc3o2)c2c(N)ncnc12
: