Target
Epidermal growth factor receptor
Ligand
BDBM291286
Substrate
Meas. Tech.
EGFR Inhibitory Activity
pH
7.5±n/a
Temperature
298.15±n/a K
IC50
157±n/a nM
Comments
extracted
Citation
 Iguchi, SHosoi, FSagara, T Fused pyrimidine compound or salt thereof US Patent  US9580432 Publication Date 2/28/2017 
Target
Name:
Epidermal growth factor receptor
Synonyms:
EGF Receptor Substrate EGFR_HUMAN ERBB1 Epidermal Growth Factor Receptor erbB-1 Epidermal growth factor receptor (EGFR) HER1 Proto-oncogene c-ErbB-1 Tyrosine-Protein Kinase ErbB-1
Type:
Receptor Kinase Domain
Mol. Mass.:
134279.59
Organism:
Homo sapiens (Human)
Description:
P00533
Residue:
1210
  
Inhibitor
Name:
BDBM291286
Synonyms:
US9580432, Example 17
Type:
Small organic molecule
Emp. Form.:
C26H30ClN9O3
Mol. Mass.:
552.028
SMILES:
CCN(CC)C\C=C\C(=O)N1CCC[C@H](C1)n1nc(C(=O)Nc2nc3cc(Cl)ccc3o2)c2c(N)ncnc12
: