Target
High affinity nerve growth factor receptor [441-796]
Ligand
BDBM226527
Substrate
Meas. Tech.
Cell Based Assay
Temperature
310.15±n/a K
IC50
1.71±n/a nM
Comments
extracted
Citation
 Bagal, SKCui, JJGreasley, SELunney, EAMcAlpine, IJNagata, ANinkovic, SOmoto, KSkerratt, SEStorer, RIWarmus, JS Tropomyosin-related kinase inhibitors US Patent  US9328096 Publication Date 5/3/2016 
Target
Name:
High affinity nerve growth factor receptor [441-796]
Synonyms:
MTC NTRK1_HUMAN TRKA Tyrosine kinase receptor A (TrkA)
Type:
Protein
Mol. Mass.:
39939.20
Organism:
Homo sapiens (Human)
Description:
Human his-tagged TrkA cytoplasmic domain (441-796 aa)
Residue:
356
  
Inhibitor
Name:
BDBM226527
Synonyms:
US9328096, 220
Type:
Small organic molecule
Emp. Form.:
C27H21Cl2N7O2
Mol. Mass.:
546.407
SMILES:
Cc1n[nH]c(C)c1NC(=O)c1cc(NC(=O)c2cc(c(Cl)cc2Cl)-c2ccccn2)n(n1)-c1ccccc1
: