Target
Serine/threonine-protein kinase mTOR
Ligand
BDBM227493
Substrate
Meas. Tech.
mTOR ATP-Binding Assay
pH
7.5±n/a
Temperature
298.15±n/a K
IC50
76±n/a nM
Comments
extracted
Citation
 Briard, EFuret, PLerchner, AMeier, PRadetich, BSandham, DAZhu, Y Purine derivatives and their use in the treatment of disease US Patent  US9334271 Publication Date 5/10/2016 
Target
Name:
Serine/threonine-protein kinase mTOR
Synonyms:
FK506-binding protein 12-rapamycin complex-associated protein 1 FRAP FRAP1 MTOR Mammalian Target of Rapamycin (mTOR) RAFT1 Rapamycin and FKBP12 target 1 Serine/threonine-protein kinase (mTOR) | mTORC2
Type:
Rapamycin target protein
Mol. Mass.:
288917.12
Organism:
Homo sapiens (Human)
Description:
P42345
Residue:
2549
  
Inhibitor
Name:
BDBM227493
Synonyms:
US9334271, 14
Type:
Small organic molecule
Emp. Form.:
C25H29N7O2
Mol. Mass.:
459.5435
SMILES:
C[C@@H]1COCCN1c1nc(nc2[nH]c(nc12)-c1cccc2[nH]ccc12)N1C2CCC1CC(O)C2
: