Target
Tyrosine-protein kinase SYK [360-635]
Ligand
BDBM227518
Substrate
Meas. Tech.
SYK Kinase Assay
Temperature
303.15±n/a K
IC50
163.7±n/a nM
Comments
extracted
Citation
 Hermann, JCKennedy-Smith, JLucas, MCPadilla, FSchoenfeld, RCWovkulich, PM Pyrrolo[2,3-B]pyrazines as SYK inhibitors US Patent  US9334278 Publication Date 5/10/2016 
Target
Name:
Tyrosine-protein kinase SYK [360-635]
Synonyms:
KSYK_HUMAN SYK RPA purified, truncated construct of Spleen Tyrosine Kinase (aa 360-635) recombinant human SYK(aa 360-635)
Type:
Mol. Mass.:
31987.15
Organism:
Homo sapiens (Human)
Description:
Human MetAP2 protein from a culture superatant of insect cells (sf9) infected with MetAP2 recombinant baculovirus
Residue:
276
  
Inhibitor
Name:
BDBM227518
Synonyms:
US9334278, I-7
Type:
Small organic molecule
Emp. Form.:
C16H19N7O
Mol. Mass.:
325.3684
SMILES:
Cc1ncc(Nc2cnc3[nH]cc(C(=O)NC(C)(C)C)c3n2)cn1
: