Target
Cannabinoid receptor 1
Ligand
BDBM50335938
Substrate
Meas. Tech.
Binding Assay
pH
7.4±n/a
Ki
>10000±n/a nM
Comments
extracted
Citation
 Attala, MNDiaz, P Heterocyclic modulators of cannabinoid receptors US Patent  US9339486 Publication Date 5/17/2016 
Target
Name:
Cannabinoid receptor 1
Synonyms:
CANN6 CB-R CNR CNR1_HUMAN Cannabinoid receptor Cannabinoid receptor 1 (brain)
Type:
G Protein-Coupled Receptor (GPCR)
Mol. Mass.:
52868.96
Organism:
Homo sapiens (Human)
Description:
P21554
Residue:
472
  
Inhibitor
Name:
BDBM50335938
Synonyms:
(3-benzyl-3-methyl-2,3-dihydrobenzofuran-6-yl)(piperidin-1-yl)methanone US9339486, 3
Type:
Small organic molecule
Emp. Form.:
C22H25NO2
Mol. Mass.:
335.4394
SMILES:
CC1(Cc2ccccc2)COc2cc(ccc12)C(=O)N1CCCCC1
: