Target
Egl nine homolog 1
Ligand
BDBM227557
Substrate
Meas. Tech.
HIF-PH Assay
pH
7.4±n/a
IC50
5200±n/a nM
Comments
extracted
Citation
 Thompson, MDPark, JMArend, MP Process for making isoquinoline compounds US Patent  US9340511 Publication Date 5/17/2016 
Target
Name:
Egl nine homolog 1
Synonyms:
C1orf12 EGLN1_HUMAN Hypoxia-inducible factor prolyl hydroxylase 2 (HIF-PH2) Prolyl hydroxylase domain-containing protein 2 (PHD2)
Type:
Protein
Mol. Mass.:
46035.59
Organism:
Homo sapiens (Human)
Description:
Q9GZT9
Residue:
426
  
Inhibitor
Name:
BDBM227557
Synonyms:
US9340511, 6 | US9708269, 6f
Type:
Small organic molecule
Emp. Form.:
C20H18N2O6
Mol. Mass.:
382.3667
SMILES:
COc1ccc(Oc2ccc3c(C)nc(C(=O)NCC(O)=O)c(O)c3c2)cc1
: