Target
Heat shock protein HSP 90-alpha [1-236]
Ligand
BDBM227592
Substrate
Meas. Tech.
Isothermal Titration Calorimetry (ITC)
pH
7.5±0
Temperature
288.15±0 K
Kd
50900±9200 nM
Citation
 Tso, SCQi, XGui, WJWu, CYChuang, JLWernstedt-Asterholm, IMorlock, LKOwens, KRScherer, PEWilliams, NSTambar, UKWynn, RMChuang, DT Structure-guided development of specific pyruvate dehydrogenase kinase inhibitors targeting the ATP-binding pocket. J Biol Chem 289:4432-43 (2014)  
Target
Name:
Heat shock protein HSP 90-alpha [1-236]
Synonyms:
HS90A_HUMAN HSP90AA1 HSPCA | Heat-shock protein 90 (Hsp90)
Type:
Enzyme
Mol. Mass.:
26556.38
Organism:
Homo sapiens (Human)
Description:
Human Hsp90 (1-236 aa)
Residue:
236
  
Inhibitor
Name:
BDBM227592
Synonyms:
PS2
Type:
Small organic molecule
Emp. Form.:
C14H13NO4S
Mol. Mass.:
291.322
SMILES:
Oc1ccc(c(O)c1)S(=O)(=O)N1Cc2ccccc2C1
: