Target
Phosphatidylinositol 4,5-bisphosphate 3-kinase catalytic subunit gamma isoform
Ligand
BDBM291356
Substrate
Meas. Tech.
Biochemical Assay
IC50
103±n/a nM
Citation
 Shuttleworth, SJLiam Cecil, ARHill, TJSilva, FA Tricyclic heterocyclic compounds as phosphoinositide 3-kinase inhibitors US Patent  US9580442 Publication Date 2/28/2017 
Target
Name:
Phosphatidylinositol 4,5-bisphosphate 3-kinase catalytic subunit gamma isoform
Synonyms:
PI3-kinase p110 subunit gamma PI3Kgamma PK3CG_HUMAN Phosphatidylinositol 4,5-bisphosphate 3-kinase (PI3K) Phosphatidylinositol 4,5-bisphosphate 3-kinase catalytic subunit gamma (PI3Kgamma) Phosphatidylinositol 4,5-bisphosphate 3-kinase catalytic subunit gamma isoform (PI3K) Phosphatidylinositol-4,5-bisphosphate 3-kinase catalytic subunit gamma isoform Phosphoinositide 3-kinases gamma (PI3K gamma) p120-PI3K
Type:
Enzyme Subunit
Mol. Mass.:
126470.30
Organism:
Homo sapiens (Human)
Description:
P48736
Residue:
1102
  
Inhibitor
Name:
BDBM291356
Synonyms:
4-Morpholin-4-yl-2-(1H-pyrrolo[2,3-b]pyridin-4-yl)-pyrido[3′,2′:4,5]furo[3,2-d]pyrimidine US9938290, D
Type:
Small organic molecule
Emp. Form.:
C20H16N6O2
Mol. Mass.:
372.38
SMILES:
C1CN(CCO1)c1nc(nc2c3cccnc3oc12)-c1ccnc2[nH]ccc12
: