Target
Beta-lactamase OXA-1
Ligand
BDBM227599
Substrate
Meas. Tech.
Kinetic Assay
pH
7.2±n/a
Ki
380±70 nM
IC50
60±5 nM
Comments
extracted
Citation
 Che, TBethel, CRPusztai-Carey, MBonomo, RACarey, PR The different inhibition mechanisms of OXA-1 and OXA-24 ß-lactamases are determined by the stability of active site carboxylated lysine. J Biol Chem 289:6152-64 (2014)  
Target
Name:
Beta-lactamase OXA-1
Synonyms:
BLO1_ECOLX Class D β-lactamase (OXA-1) oxa1
Type:
Enzyme
Mol. Mass.:
30882.83
Organism:
Escherichia coli (Enterobacteria)
Description:
Q83ZU9
Residue:
276
  
Inhibitor
Name:
BDBM227599
Synonyms:
Penem 3
Type:
Small organic molecule
Emp. Form.:
C13H10N3O4S
Mol. Mass.:
304.302
SMILES:
[O-]C(=O)C1=CS[C@H]2N1C(=O)\C2=C\c1cn2CCOCc2n1
: