Target
Oxidized purine nucleoside triphosphate hydrolase
Ligand
BDBM227635
Substrate
BDBM227639
Meas. Tech.
In Vitro MTH1 Enzymatic Assay
pH
7.5±n/a
IC50
4.8e+3± 9e+2 nM
Comments
extracted
Citation
 Kumar, AKawamura, TKawatani, MOsada, HZhang, KYJ Identification and structure-activity relationship of purine derivatives as novel MTH1 inhibitors. Chem Biol Drug Des 89:862-869 (2017)  
Target
Name:
Oxidized purine nucleoside triphosphate hydrolase
Synonyms:
7,8-dihydro-8-oxoguanine triphosphatase MTH1 NUDT1
Type:
Protein
Mol. Mass.:
22514.81
Organism:
Homo sapiens (Human)
Description:
P36639
Residue:
197
  
Inhibitor
Name:
BDBM227635
Synonyms:
MTH1 inhibitor, 122
Type:
Small organic molecule
Emp. Form.:
C8H12N6O
Mol. Mass.:
208.2205
SMILES:
COCCNc1nc(N)nc2[nH]cnc12
:
Substrate
Name:
BDBM227639
Synonyms:
8-Oxo-2'-deoxyguanosine-5'-triphosphate | 8-Oxo-dGTP
Type:
Small organic molecule
Emp. Form.:
C10H16N5O14P3
Mol. Mass.:
523.1804
SMILES:
Nc1nc(=O)c2[nH]c(=O)n([C@H]3C[C@H](O)[C@@H](COP(O)(=O)OP(O)(=O)OP(O)(O)=O)O3)c2[nH]1
: