Target
Oxidized purine nucleoside triphosphate hydrolase
Ligand
BDBM227634
Substrate
BDBM227640
Meas. Tech.
In Vitro MTH1 Enzymatic Assay
pH
7.5±n/a
IC50
4.2e+2± 2.5e+2 nM
Comments
extracted
Citation
 Kumar, AKawamura, TKawatani, MOsada, HZhang, KYJ Identification and structure-activity relationship of purine derivatives as novel MTH1 inhibitors. Chem Biol Drug Des 89:862-869 (2017)  
Target
Name:
Oxidized purine nucleoside triphosphate hydrolase
Synonyms:
2-hydroxy-dATP diphosphatase 3.6.1.56 8-oxo-dGTPase MTH1 MutT homolog 1 protein (MTH1) Nucleoside diphosphate-linked moiety X motif 1 Oxidized purine nucleoside triphosphate hydrolase [42-197]
Type:
Protein
Mol. Mass.:
22514.81
Organism:
Homo sapiens (Human)
Description:
P36639
Residue:
156
  
Inhibitor
Name:
BDBM227634
Synonyms:
MTH1 inhibitor, 121
Type:
Small organic molecule
Emp. Form.:
C15H18N6O2
Mol. Mass.:
314.3424
SMILES:
COc1ccc(CCNc2nc(N)nc3[nH]cnc23)cc1OC
:
Substrate
Name:
BDBM227640
Synonyms:
2-OH-dATP
Type:
Small organic molecule
Emp. Form.:
C10H16N5O13P3
Mol. Mass.:
507.181
SMILES:
Nc1nc(=O)[nH]c2n(cnc12)[C@H]1C[C@H](O)[C@@H](COP(O)(=O)OP(O)(=O)OP(O)(O)=O)O1
: